Reaction Details
TargetFatty acid synthase
LigandBDBM50426435
Substrate/Competitorn/a
Meas. Tech.ChEMBL_940339 (CHEMBL2328957)
IC50 40±n/a nM
Citation Oslob, JDJohnson, RJCai, HFeng, SQHu, LKosaka, YLai, JSivaraja, MTep, SYang, HZaharia, CAEvanchik, MJMcDowell, RS Imidazopyridine-Based Fatty Acid Synthase Inhibitors That Show Anti-HCV Activity and in Vivo Target Modulation. ACS Med Chem Lett4:113-7 (2013) 
 
Fatty acid synthase
Name:Fatty acid synthase
Type:Enzyme
Mol. Mass.:273419.37
Organism:Homo sapiens (Human)
Description:P49327
Residue:2511
BDBM50426435
NameBDBM50426435
Synonyms:CHEMBL2322370
TypeSmall organic molecule
Emp. Form.C31H32N6O2
Mol. Mass.520.6248
SMILESCc1cc(C)c(cc1C(=O)N1CCC(CC1)c1ccc(cc1)C#N)-c1nc2cc(ncc2[nH]1)N1CCOCC1