Reaction Details
Target5-hydroxytryptamine receptor 2B
LigandBDBM50426500
Substrate/Competitorn/a
Meas. Tech.ChEMBL_938246 (CHEMBL2328669)
Ki 0.970000±n/a nM
Citation Dosa, PIWard, TWalters, MAKim, SW Synthesis of novel analogs of cabergoline: improving cardiovascular safety by removing 5-HT2B receptor agonism. ACS Med Chem Lett4:254-258 (2013) 
 
5-hydroxytryptamine receptor 2B
Name:5-hydroxytryptamine receptor 2B
Type:G Protein-Coupled Receptor (GPCR)
Mol. Mass.:54312.47
Organism:Homo sapiens (Human)
Description:Receptor binding assays were performed using human clone stably expressed in CHO cells.
Residue:481
BDBM50426500
NameBDBM50426500
Synonyms:CHEMBL2323580
TypeSmall organic molecule
Emp. Form.C22H32N4O
Mol. Mass.368.5157
SMILESCN(C)CCCNC(=O)[C@@H]1C[C@H]2[C@@H](Cc3cn(C)c4cccc2c34)N(C)C1