Reaction Details
TargetBotulinum neurotoxin type A
LigandBDBM43865
Substrate/Competitorn/a
Meas. Tech.ChEMBL_938419 (CHEMBL2329362)
Ki 25000±n/a nM
Citation Silhár, PLardy, MAHixon, MSShoemaker, CBBarbieri, JTStruss, AKLively, JMJavor, SJanda, KD The C-terminus of Botulinum A Protease Has Profound and Unanticipated Kinetic Consequences Upon the Catalytic Cleft. ACS Med Chem Lett4:283-287 (2013) 
 
Botulinum neurotoxin type A
Name:Botulinum neurotoxin type A
Type:PROTEIN
Mol. Mass.:149450.01
Organism:Clostridium botulinum
Description:ChEMBL_1510137
Residue:1296
BDBM43865
NameBDBM43865
Synonyms:6-formyl-4,7-dihydroxy-9-keto-5H-phenazine-1-carboxylic acid methyl ester Glycopeptide, 4 MLS000766240 cid_5351222 methyl 6-methanoyl-4,7-bis(oxidanyl)-9-oxidanylidene-5H-phenazine-1-carboxylate
TypePeptide
Emp. Form.C15H10N2O6
Mol. Mass.314.2497
SMILESCOC(=O)c1ccc(O)c2nc3c(C=O)c(O)cc(O)c3nc12