Reaction Details
TargetTransient receptor potential cation channel subfamily V member 4
LigandBDBM50426532
Substrate/Competitorn/a
Meas. Tech.ChEMBL_938602 (CHEMBL2327222)
IC50 3.2±n/a nM
Citation Hilfiker, MAHoang, THCornil, JEidam, HSMatasic, DSRoethke, TJKlein, MThorneloe, KSCheung, M Optimization of a Novel Series of TRPV4 Antagonists with In Vivo Activity in a Model of Pulmonary Edema. ACS Med Chem Lett4:293-6 (2013) 
 
Transient receptor potential cation channel subfamily V member 4
Name:Transient receptor potential cation channel subfamily V member 4
Type:Enzyme
Mol. Mass.:98290.10
Organism:Homo sapiens (Human)
Description:Q9HBA0
Residue:871
BDBM50426532
NameBDBM50426532
Synonyms:CHEMBL2323936
TypeSmall organic molecule
Emp. Form.C30H36Cl2N6O2
Mol. Mass.583.552
SMILESCC(C)Nc1nc2c(C(=O)N(C)C)c(Cl)c(Cl)cc2n1C1CCN(CC1)c1ccc(cc1)C1(CCOCC1)C#N