Reaction Details
TargetTransient receptor potential cation channel subfamily V member 4
LigandBDBM50426534
Substrate/Competitorn/a
Meas. Tech.ChEMBL_938602 (CHEMBL2327222)
IC50 16±n/a nM
Citation Hilfiker, MAHoang, THCornil, JEidam, HSMatasic, DSRoethke, TJKlein, MThorneloe, KSCheung, M Optimization of a Novel Series of TRPV4 Antagonists with In Vivo Activity in a Model of Pulmonary Edema. ACS Med Chem Lett4:293-6 (2013) 
 
Transient receptor potential cation channel subfamily V member 4
Name:Transient receptor potential cation channel subfamily V member 4
Type:Enzyme
Mol. Mass.:98290.10
Organism:Homo sapiens (Human)
Description:Q9HBA0
Residue:871
BDBM50426534
NameBDBM50426534
Synonyms:CHEMBL2323944
TypeSmall organic molecule
Emp. Form.C29H37Cl2N5O3
Mol. Mass.574.542
SMILESCOC(=O)C(C)(C)c1ccc(cc1)N1CCC(CC1)n1c(NC(C)C)nc2c(C(=O)N(C)C)c(Cl)c(Cl)cc12