Reaction Details
TargetD(2) dopamine receptor
LigandBDBM50426674
Substrate/Competitorn/a
Meas. Tech.ChEMBL_939641 (CHEMBL2328745)
Ki 15±n/a nM
Citation Urbanek, RAXiong, HWu, YBlackwell, WSteelman, GRosamond, JWesolowski, SSCampbell, JBZhang, MBrockel, BWidzowski, DV Synthesis and SAR of aminothiazole fused benzazepines as selective dopamine D2 partial agonists. Bioorg Med Chem Lett23:543-7 (2012) 
 
D(2) dopamine receptor
Name:D(2) dopamine receptor
Type:Cell-surface receptors
Mol. Mass.:50647.10
Organism:Homo sapiens (Human)
Description:P14416
Residue:443
BDBM50426674
NameBDBM50426674
Synonyms:CHEMBL2326472
TypeSmall organic molecule
Emp. Form.C16H19N5S
Mol. Mass.313.421
SMILESCn1cc(CN2CCc3cc4nc(N)sc4cc3CC2)cn1