Reaction Details
TargetCarbonic anhydrase 9
LigandBDBM50426705
Substrate/Competitorn/a
Meas. Tech.ChEMBL_939843 (CHEMBL2329436)
Ki 46±n/a nM
Citation Tars, KVullo, DKazaks, ALeitans, JLends, AGrandane, AZalubovskis, RScozzafava, ASupuran, CT Sulfocoumarins (1,2-benzoxathiine-2,2-dioxides): a class of potent and isoform-selective inhibitors of tumor-associated carbonic anhydrases. J Med Chem56:293-300 (2013) 
 
Carbonic anhydrase 9
Name:Carbonic anhydrase 9
Type:Enzyme
Mol. Mass.:49669.03
Organism:Homo sapiens (Human)
Description:Catalytic domain of human cloned isozyme was used in the assay
Residue:459
BDBM50426705
NameBDBM50426705
Synonyms:CHEMBL2326511
TypeSmall organic molecule
Emp. Form.C8H7NO3S
Mol. Mass.197.211
SMILESNc1ccc2OS(=O)(=O)C=Cc2c1