Reaction Details
TargetCarbonic anhydrase 9
LigandBDBM50426709
Substrate/Competitorn/a
Meas. Tech.ChEMBL_939843 (CHEMBL2329436)
Ki 275±n/a nM
Citation Tars, KVullo, DKazaks, ALeitans, JLends, AGrandane, AZalubovskis, RScozzafava, ASupuran, CT Sulfocoumarins (1,2-benzoxathiine-2,2-dioxides): a class of potent and isoform-selective inhibitors of tumor-associated carbonic anhydrases. J Med Chem56:293-300 (2013) 
 
Carbonic anhydrase 9
Name:Carbonic anhydrase 9
Type:Enzyme
Mol. Mass.:49669.03
Organism:Homo sapiens (Human)
Description:Catalytic domain of human cloned isozyme was used in the assay
Residue:459
BDBM50426709
NameBDBM50426709
Synonyms:CHEMBL2326508
TypeSmall organic molecule
Emp. Form.C15H12O4S
Mol. Mass.288.318
SMILESO=S1(=O)Oc2ccc(OCc3ccccc3)cc2C=C1