Reaction Details
TargetCarbonic anhydrase 2
LigandBDBM50426698
Substrate/Competitorn/a
Meas. Tech.ChEMBL_939844 (CHEMBL2329437)
Ki 9370±n/a nM
Citation Tars, KVullo, DKazaks, ALeitans, JLends, AGrandane, AZalubovskis, RScozzafava, ASupuran, CT Sulfocoumarins (1,2-benzoxathiine-2,2-dioxides): a class of potent and isoform-selective inhibitors of tumor-associated carbonic anhydrases. J Med Chem56:293-300 (2013) 
 
Carbonic anhydrase 2
Name:Carbonic anhydrase 2
Type:Enzyme
Mol. Mass.:29250.71
Organism:Homo sapiens (Human)
Description:P00918
Residue:260
BDBM50426698
NameBDBM50426698
Synonyms:CHEMBL2326518
TypeSmall organic molecule
Emp. Form.C15H18N4O3S
Mol. Mass.334.393
SMILESCCN(CC)Cc1cn(nn1)-c1ccc2OS(=O)(=O)C=Cc2c1