Reaction Details
TargetCarbonic anhydrase 1
LigandBDBM50426699
Substrate/Competitorn/a
Meas. Tech.ChEMBL_939845 (CHEMBL2329438)
Ki 7200±n/a nM
Citation Tars, KVullo, DKazaks, ALeitans, JLends, AGrandane, AZalubovskis, RScozzafava, ASupuran, CT Sulfocoumarins (1,2-benzoxathiine-2,2-dioxides): a class of potent and isoform-selective inhibitors of tumor-associated carbonic anhydrases. J Med Chem56:293-300 (2013) 
 
Carbonic anhydrase 1
Name:Carbonic anhydrase 1
Type:Enzyme
Mol. Mass.:28873.37
Organism:Homo sapiens (Human)
Description:P00915
Residue:261
BDBM50426699
NameBDBM50426699
Synonyms:CHEMBL2326517
TypeSmall organic molecule
Emp. Form.C11H9N3O4S
Mol. Mass.279.272
SMILESOCc1cn(nn1)-c1ccc2OS(=O)(=O)C=Cc2c1