Reaction Details
TargetCarbonic anhydrase 1
LigandBDBM50426702
Substrate/Competitorn/a
Meas. Tech.ChEMBL_939845 (CHEMBL2329438)
Ki 8050±n/a nM
Citation Tars, KVullo, DKazaks, ALeitans, JLends, AGrandane, AZalubovskis, RScozzafava, ASupuran, CT Sulfocoumarins (1,2-benzoxathiine-2,2-dioxides): a class of potent and isoform-selective inhibitors of tumor-associated carbonic anhydrases. J Med Chem56:293-300 (2013) 
 
Carbonic anhydrase 1
Name:Carbonic anhydrase 1
Type:Enzyme
Mol. Mass.:28873.37
Organism:Homo sapiens (Human)
Description:P00915
Residue:261
BDBM50426702
NameBDBM50426702
Synonyms:CHEMBL2326514
TypeSmall organic molecule
Emp. Form.C12H9N3O5S
Mol. Mass.307.282
SMILESCOC(=O)c1cn(nn1)-c1ccc2OS(=O)(=O)C=Cc2c1