Reaction Details
TargetCarbonic anhydrase 1
LigandBDBM50426703
Substrate/Competitorn/a
Meas. Tech.ChEMBL_939845 (CHEMBL2329438)
Ki 6860±n/a nM
Citation Tars, KVullo, DKazaks, ALeitans, JLends, AGrandane, AZalubovskis, RScozzafava, ASupuran, CT Sulfocoumarins (1,2-benzoxathiine-2,2-dioxides): a class of potent and isoform-selective inhibitors of tumor-associated carbonic anhydrases. J Med Chem56:293-300 (2013) 
 
Carbonic anhydrase 1
Name:Carbonic anhydrase 1
Type:Enzyme
Mol. Mass.:28873.37
Organism:Homo sapiens (Human)
Description:P00915
Residue:261
BDBM50426703
NameBDBM50426703
Synonyms:CHEMBL2326513
TypeSmall organic molecule
Emp. Form.C16H11N3O3S
Mol. Mass.325.342
SMILESO=S1(=O)Oc2ccc(cc2C=C1)-n1cc(nn1)-c1ccccc1