Reaction Details
TargetCarbonic anhydrase 1
LigandBDBM50426710
Substrate/Competitorn/a
Meas. Tech.ChEMBL_939845 (CHEMBL2329438)
Ki 99000±n/a nM
Citation Tars, KVullo, DKazaks, ALeitans, JLends, AGrandane, AZalubovskis, RScozzafava, ASupuran, CT Sulfocoumarins (1,2-benzoxathiine-2,2-dioxides): a class of potent and isoform-selective inhibitors of tumor-associated carbonic anhydrases. J Med Chem56:293-300 (2013) 
 
Carbonic anhydrase 1
Name:Carbonic anhydrase 1
Type:Enzyme
Mol. Mass.:28873.37
Organism:Homo sapiens (Human)
Description:P00915
Residue:261
BDBM50426710
NameBDBM50426710
Synonyms:CHEMBL2326507
TypeSmall organic molecule
Emp. Form.C9H8O6S2
Mol. Mass.276.286
SMILESCOS(=O)(=O)c1ccc2OS(=O)(=O)C=Cc2c1