Reaction Details
TargetCarbonic anhydrase 1
LigandBDBM50426711
Substrate/Competitorn/a
Meas. Tech.ChEMBL_939845 (CHEMBL2329438)
Ki 91000±n/a nM
Citation Tars, KVullo, DKazaks, ALeitans, JLends, AGrandane, AZalubovskis, RScozzafava, ASupuran, CT Sulfocoumarins (1,2-benzoxathiine-2,2-dioxides): a class of potent and isoform-selective inhibitors of tumor-associated carbonic anhydrases. J Med Chem56:293-300 (2013) 
 
Carbonic anhydrase 1
Name:Carbonic anhydrase 1
Type:Enzyme
Mol. Mass.:28873.37
Organism:Homo sapiens (Human)
Description:P00915
Residue:261
BDBM50426711
NameBDBM50426711
Synonyms:CHEMBL2326506
TypeSmall organic molecule
Emp. Form.C8H6O4S
Mol. Mass.198.196
SMILESOc1ccc2OS(=O)(=O)C=Cc2c1