Reaction Details
TargetD-amino-acid oxidase
LigandBDBM31147
Substrate/Competitorn/a
Meas. Tech.ChEMBL_938779 (CHEMBL2327788)
Ki 36±n/a nM
Citation Katane, MOsaka, NMatsuda, SMaeda, KKawata, TSaitoh, YSekine, MFuruchi, TDoi, IHirono, SHomma, H Identification of novel D-amino acid oxidase inhibitors by in silico screening and their functional characterization in vitro. J Med Chem56:1894-907 (2013) 
 
D-amino-acid oxidase
Name:D-amino-acid oxidase
Type:Homodimer
Mol. Mass.:39476.06
Organism:Homo sapiens (Human)
Description:P14920
Residue:347
BDBM31147
NameBDBM31147
Synonyms:4H-furo[3,2-b]pyrrole-5-carboxylic acid CHEMBL492591
TypeSmall organic molecule
Emp. Form.C7H5NO3
Mol. Mass.151.1195
SMILESOC(=O)c1cc2occc2[nH]1