Reaction Details
TargetD-amino-acid oxidase
LigandBDBM50427206
Substrate/Competitorn/a
Meas. Tech.ChEMBL_938779 (CHEMBL2327788)
Ki 9920±n/a nM
Citation Katane, MOsaka, NMatsuda, SMaeda, KKawata, TSaitoh, YSekine, MFuruchi, TDoi, IHirono, SHomma, H Identification of novel D-amino acid oxidase inhibitors by in silico screening and their functional characterization in vitro. J Med Chem56:1894-907 (2013) 
 
D-amino-acid oxidase
Name:D-amino-acid oxidase
Type:Homodimer
Mol. Mass.:39476.06
Organism:Homo sapiens (Human)
Description:P14920
Residue:347
BDBM50427206
NameBDBM50427206
Synonyms:CHEMBL2324852
TypeSmall organic molecule
Emp. Form.C8H8O2S
Mol. Mass.168.213
SMILESOC(=O)c1cc2CCCc2s1