Reaction Details
TargetD-aspartate oxidase
LigandBDBM14673
Substrate/Competitorn/a
Meas. Tech.ChEMBL_938789 (CHEMBL2327933)
IC50 1355000±n/a nM
Citation Katane, MOsaka, NMatsuda, SMaeda, KKawata, TSaitoh, YSekine, MFuruchi, TDoi, IHirono, SHomma, H Identification of novel D-amino acid oxidase inhibitors by in silico screening and their functional characterization in vitro. J Med Chem56:1894-907 (2013) 
 
D-aspartate oxidase
Name:D-aspartate oxidase
Type:Oxidoreductase
Mol. Mass.:37543.06
Organism:Homo sapiens (Human)
Description:Recombinant human DDO expressed and purified from sf9 insect cells, was used in enzyme assays.
Residue:341
BDBM14673
NameBDBM14673
Synonyms:Fragment 3 propanedioic acid
TypeSmall organic molecule
Emp. Form.C3H4O4
Mol. Mass.104.0615
SMILESOC(=O)CC(O)=O