Reaction Details
TargetCarbonic anhydrase 1
LigandBDBM10890
Substrate/Competitorn/a
Meas. Tech.ChEMBL_938521 (CHEMBL2327205)
Ki 31±n/a nM
Citation Pan, PVermelho, ABCapaci Rodrigues, GScozzafava, ATolvanen, MEParkkila, SCapasso, CSupuran, CT Cloning, characterization, and sulfonamide and thiol inhibition studies of ana-carbonic anhydrase from Trypanosoma cruzi, the causative agent of Chagas disease. J Med Chem56:1761-71 (2013) 
 
Carbonic anhydrase 1
Name:Carbonic anhydrase 1
Type:Enzyme
Mol. Mass.:28873.37
Organism:Homo sapiens (Human)
Description:P00915
Residue:261
BDBM10890
NameBDBM10890
Synonyms:1-N-(3-chloro-1H-indol-7-yl)benzene-1,4-disulfonamide Compound 6 Indisulam (IND) | Sulfonamide, 7
TypeSmall organic molecule
Emp. Form.C14H12ClN3O4S2
Mol. Mass.385.846
SMILESNS(=O)(=O)c1ccc(cc1)S(=O)(=O)Nc1cccc2c(Cl)c[nH]c12