Reaction Details
TargetReceptor tyrosine-protein kinase erbB-3
LigandBDBM50427225
Substrate/Competitorn/a
Meas. Tech.ChEMBL_938526 (CHEMBL2327210)
IC50 35900±n/a nM
Citation Yang, WHu, YYang, YSZhang, FZhang, YBWang, XLTang, JFZhong, WQZhu, HL Design, modification and 3D QSAR studies of novel naphthalin-containing pyrazoline derivatives with/without thiourea skeleton as anticancer agents. Bioorg Med Chem21:1050-63 (2013) 
 
Receptor tyrosine-protein kinase erbB-3
Name:Receptor tyrosine-protein kinase erbB-3
Type:PROTEIN
Mol. Mass.:148097.73
Organism:Homo sapiens (Human)
Description:ChEMBL_774331
Residue:1342
BDBM50427225
NameBDBM50427225
Synonyms:CHEMBL2325101
TypeSmall organic molecule
Emp. Form.C25H18Cl2N2
Mol. Mass.417.33
SMILESClc1ccc(cc1Cl)C1=NN(C(C1)c1ccc2ccccc2c1)c1ccccc1