Reaction Details
TargetVascular endothelial growth factor receptor 2
LigandBDBM50427225
Substrate/Competitorn/a
Meas. Tech.ChEMBL_938527 (CHEMBL2327211)
IC50 1830±n/a nM
Citation Yang, WHu, YYang, YSZhang, FZhang, YBWang, XLTang, JFZhong, WQZhu, HL Design, modification and 3D QSAR studies of novel naphthalin-containing pyrazoline derivatives with/without thiourea skeleton as anticancer agents. Bioorg Med Chem21:1050-63 (2013) 
 
Vascular endothelial growth factor receptor 2
Name:Vascular endothelial growth factor receptor 2
Type:Receptor Tyrosine Kinase
Mol. Mass.:151510.97
Organism:Homo sapiens (Human)
Description:P35968
Residue:1356
BDBM50427225
NameBDBM50427225
Synonyms:CHEMBL2325101
TypeSmall organic molecule
Emp. Form.C25H18Cl2N2
Mol. Mass.417.33
SMILESClc1ccc(cc1Cl)C1=NN(C(C1)c1ccc2ccccc2c1)c1ccccc1