Reaction Details
TargetReceptor tyrosine-protein kinase erbB-2
LigandBDBM50427245
Substrate/Competitorn/a
Meas. Tech.ChEMBL_938530 (CHEMBL2327214)
IC50 1750±n/a nM
Citation Yang, WHu, YYang, YSZhang, FZhang, YBWang, XLTang, JFZhong, WQZhu, HL Design, modification and 3D QSAR studies of novel naphthalin-containing pyrazoline derivatives with/without thiourea skeleton as anticancer agents. Bioorg Med Chem21:1050-63 (2013) 
 
Receptor tyrosine-protein kinase erbB-2
Name:Receptor tyrosine-protein kinase erbB-2
Type:n/a
Mol. Mass.:137894.47
Organism:Homo sapiens (Human)
Description:P04626
Residue:1255
BDBM50427245
NameBDBM50427245
Synonyms:CHEMBL2325110
TypeSmall organic molecule
Emp. Form.C20H16FN3S
Mol. Mass.349.425
SMILESNC(=S)N1N=C(CC1c1ccc2ccccc2c1)c1ccc(F)cc1