Reaction Details
TargetEpidermal growth factor receptor
LigandBDBM50427240
Substrate/Competitorn/a
Meas. Tech.ChEMBL_938532 (CHEMBL2327216)
IC50 1070±n/a nM
Citation Yang, WHu, YYang, YSZhang, FZhang, YBWang, XLTang, JFZhong, WQZhu, HL Design, modification and 3D QSAR studies of novel naphthalin-containing pyrazoline derivatives with/without thiourea skeleton as anticancer agents. Bioorg Med Chem21:1050-63 (2013) 
 
Epidermal growth factor receptor
Name:Epidermal growth factor receptor
Type:Receptor Kinase Domain
Mol. Mass.:134279.59
Organism:Homo sapiens (Human)
Description:P00533
Residue:1210
BDBM50427240
NameBDBM50427240
Synonyms:CHEMBL2325089
TypeSmall organic molecule
Emp. Form.C25H19FN2
Mol. Mass.366.4302
SMILESFc1ccc(cc1)C1=NN(C(C1)c1cccc2ccccc12)c1ccccc1