Reaction Details
TargetEpidermal growth factor receptor
LigandBDBM50427247
Substrate/Competitorn/a
Meas. Tech.ChEMBL_938532 (CHEMBL2327216)
IC50 210±n/a nM
Citation Yang, WHu, YYang, YSZhang, FZhang, YBWang, XLTang, JFZhong, WQZhu, HL Design, modification and 3D QSAR studies of novel naphthalin-containing pyrazoline derivatives with/without thiourea skeleton as anticancer agents. Bioorg Med Chem21:1050-63 (2013) 
 
Epidermal growth factor receptor
Name:Epidermal growth factor receptor
Type:Receptor Kinase Domain
Mol. Mass.:134279.59
Organism:Homo sapiens (Human)
Description:P00533
Residue:1210
BDBM50427247
NameBDBM50427247
Synonyms:CHEMBL2325108
TypeSmall organic molecule
Emp. Form.C20H15Cl2N3S
Mol. Mass.400.324
SMILESNC(=S)N1N=C(CC1c1cccc2ccccc12)c1ccc(Cl)c(Cl)c1