Reaction Details
TargetEpidermal growth factor receptor
LigandBDBM50427251
Substrate/Competitorn/a
Meas. Tech.ChEMBL_938532 (CHEMBL2327216)
IC50 8250±n/a nM
Citation Yang, WHu, YYang, YSZhang, FZhang, YBWang, XLTang, JFZhong, WQZhu, HL Design, modification and 3D QSAR studies of novel naphthalin-containing pyrazoline derivatives with/without thiourea skeleton as anticancer agents. Bioorg Med Chem21:1050-63 (2013) 
 
Epidermal growth factor receptor
Name:Epidermal growth factor receptor
Type:Receptor Kinase Domain
Mol. Mass.:134279.59
Organism:Homo sapiens (Human)
Description:P00533
Residue:1210
BDBM50427251
NameBDBM50427251
Synonyms:CHEMBL2325103
TypeSmall organic molecule
Emp. Form.C20H16FN3S
Mol. Mass.349.425
SMILESNC(=S)N1N=C(CC1c1cccc2ccccc12)c1ccc(F)cc1