Reaction Details
TargetSerine/threonine-protein kinase D1
LigandBDBM50427363
Substrate/Competitorn/a
Meas. Tech.ChEMBL_941097 (CHEMBL2330894)
Ki 2420±n/a nM
Citation Jimenez, JMBoyall, DBrenchley, GCollier, PNDavis, CJFraysse, DKeily, SBHenderson, JMiller, APierard, FSettimo, LTwin, HCBolton, CMCurnock, APChiu, PTanner, AJYoung, S Design and optimization of selective protein kinase C¿ (PKC¿) inhibitors for the treatment of autoimmune diseases. J Med Chem56:1799-810 (2013) 
 
Serine/threonine-protein kinase D1
Name:Serine/threonine-protein kinase D1
Type:Serine/threonine-protein kinase
Mol. Mass.:101705.07
Organism:Homo sapiens (Human)
Description:gi_115529463
Residue:912
BDBM50427363
NameBDBM50427363
Synonyms:CHEMBL2326002
TypeSmall organic molecule
Emp. Form.C20H24ClFN6O
Mol. Mass.418.896
SMILESCC(C)[C@@](C)(O)[C@@H]1CN(CCN1)c1nc(-c2n[nH]c3ncccc23)c(F)cc1Cl