Reaction Details
TargetProtein kinase C delta type
LigandBDBM50427368
Substrate/Competitorn/a
Meas. Tech.ChEMBL_941118 (CHEMBL2330915)
Ki 957±n/a nM
Citation Jimenez, JMBoyall, DBrenchley, GCollier, PNDavis, CJFraysse, DKeily, SBHenderson, JMiller, APierard, FSettimo, LTwin, HCBolton, CMCurnock, APChiu, PTanner, AJYoung, S Design and optimization of selective protein kinase C¿ (PKC¿) inhibitors for the treatment of autoimmune diseases. J Med Chem56:1799-810 (2013) 
 
Protein kinase C delta type
Name:Protein kinase C delta type
Type:Enzyme
Mol. Mass.:77516.79
Organism:Homo sapiens (Human)
Description:The recombinant human PKC enzymes were produced using a baculovirus expression system in SF9 cells
Residue:676
BDBM50427368
NameBDBM50427368
Synonyms:CHEMBL2326013
TypeSmall organic molecule
Emp. Form.C21H25F3N6O
Mol. Mass.434.458
SMILESCC(C)[C@@](C)(O)[C@@H]1CN(CCN1)c1ccc(c(n1)-c1n[nH]c2ncccc12)C(F)(F)F