Reaction Details
TargetProtein kinase C theta type
LigandBDBM50427381
Substrate/Competitorn/a
Meas. Tech.ChEMBL_941193 (CHEMBL2329704)
Ki 5.0±n/a nM
Citation Jimenez, JMBoyall, DBrenchley, GCollier, PNDavis, CJFraysse, DKeily, SBHenderson, JMiller, APierard, FSettimo, LTwin, HCBolton, CMCurnock, APChiu, PTanner, AJYoung, S Design and optimization of selective protein kinase C¿ (PKC¿) inhibitors for the treatment of autoimmune diseases. J Med Chem56:1799-810 (2013) 
 
Protein kinase C theta type
Name:Protein kinase C theta type
Type:Serine/threonine-protein kinase
Mol. Mass.:81878.04
Organism:Homo sapiens (Human)
Description:Full-length human PKC theta (Panvera Catalog No. P2996).
Residue:706
BDBM50427381
NameBDBM50427381
Synonyms:CHEMBL2326020
TypeSmall organic molecule
Emp. Form.C21H20N6
Mol. Mass.356.4237
SMILESC1CN(C[C@H](N1)c1ccccc1)c1cccc(n1)-c1n[nH]c2ncccc12