Reaction Details
TargetProtein kinase C theta type
LigandBDBM50427382
Substrate/Competitorn/a
Meas. Tech.ChEMBL_941193 (CHEMBL2329704)
Ki 2.0±n/a nM
Citation Jimenez, JMBoyall, DBrenchley, GCollier, PNDavis, CJFraysse, DKeily, SBHenderson, JMiller, APierard, FSettimo, LTwin, HCBolton, CMCurnock, APChiu, PTanner, AJYoung, S Design and optimization of selective protein kinase C¿ (PKC¿) inhibitors for the treatment of autoimmune diseases. J Med Chem56:1799-810 (2013) 
 
Protein kinase C theta type
Name:Protein kinase C theta type
Type:Serine/threonine-protein kinase
Mol. Mass.:81878.04
Organism:Homo sapiens (Human)
Description:Full-length human PKC theta (Panvera Catalog No. P2996).
Residue:706
BDBM50427382
NameBDBM50427382
Synonyms:CHEMBL2326019
TypeSmall organic molecule
Emp. Form.C19H24N6
Mol. Mass.336.4341
SMILESCC(C)C[C@H]1CN(CCN1)c1cccc(n1)-c1n[nH]c2ncccc12