Reaction Details
TargetMitogen-activated protein kinase 3
LigandBDBM50427363
Substrate/Competitorn/a
Meas. Tech.ChEMBL_941104 (CHEMBL2330901)
Ki>1000±n/a nM
Citation Jimenez, JMBoyall, DBrenchley, GCollier, PNDavis, CJFraysse, DKeily, SBHenderson, JMiller, APierard, FSettimo, LTwin, HCBolton, CMCurnock, APChiu, PTanner, AJYoung, S Design and optimization of selective protein kinase C¿ (PKC¿) inhibitors for the treatment of autoimmune diseases. J Med Chem56:1799-810 (2013) 
 
Mitogen-activated protein kinase 3
Name:Mitogen-activated protein kinase 3
Type:Protein
Mol. Mass.:43136.58
Organism:Homo sapiens (Human)
Description:curated by PDB 4QTB
Residue:379
BDBM50427363
NameBDBM50427363
Synonyms:CHEMBL2326002
TypeSmall organic molecule
Emp. Form.C20H24ClFN6O
Mol. Mass.418.896
SMILESCC(C)[C@@](C)(O)[C@@H]1CN(CCN1)c1nc(-c2n[nH]c3ncccc23)c(F)cc1Cl