Reaction Details
TargetProtein kinase C theta type
LigandBDBM50427365
Substrate/Competitorn/a
Meas. Tech.ChEMBL_941193 (CHEMBL2329704)
IC50 1.000000±n/a nM
Citation Jimenez, JMBoyall, DBrenchley, GCollier, PNDavis, CJFraysse, DKeily, SBHenderson, JMiller, APierard, FSettimo, LTwin, HCBolton, CMCurnock, APChiu, PTanner, AJYoung, S Design and optimization of selective protein kinase C¿ (PKC¿) inhibitors for the treatment of autoimmune diseases. J Med Chem56:1799-810 (2013) 
 
Protein kinase C theta type
Name:Protein kinase C theta type
Type:Serine/threonine-protein kinase
Mol. Mass.:81878.04
Organism:Homo sapiens (Human)
Description:Full-length human PKC theta (Panvera Catalog No. P2996).
Residue:706
BDBM50427365
NameBDBM50427365
Synonyms:CHEMBL2326000
TypeSmall organic molecule
Emp. Form.C21H27FN6O2
Mol. Mass.414.4765
SMILESCC(C)[C@@](C)(O)[C@@H]1CN(CCN1)c1nc(-c2n[nH]c3ncccc23)c(F)cc1CO