Reaction Details
TargetNuclear factor NF-kappa-B p105 subunit
LigandBDBM50427496
Substrate/Competitorn/a
Meas. Tech.ChEMBL_941587 (CHEMBL2330627)
EC50 5000000±n/a nM
Citation Marzaro, GGuiotto, ABorgatti, MFinotti, AGambari, RBreveglieri, GChilin, A Psoralen derivatives as inhibitors of NF-¿B/DNA interaction: synthesis, molecular modeling, 3D-QSAR, and biological evaluation. J Med Chem56:1830-42 (2013) 
 
Nuclear factor NF-kappa-B p105 subunit
Name:Nuclear factor NF-kappa-B p105 subunit
Type:Protein
Mol. Mass.:105329.57
Organism:Homo sapiens (Human)
Description:P19838
Residue:968
BDBM50427496
NameBDBM50427496
Synonyms:CHEMBL2322556
TypeSmall organic molecule
Emp. Form.C26H26ClNO4
Mol. Mass.451.942
SMILESCc1c(CC(=O)NCc2ccccc2Cl)c(=O)oc2c(C)c3occ(c3cc12)C(C)(C)C