Reaction Details
TargetNuclear factor NF-kappa-B p105 subunit
LigandBDBM50427518
Substrate/Competitorn/a
Meas. Tech.ChEMBL_941587 (CHEMBL2330627)
EC50>10000000±n/a nM
Citation Marzaro, GGuiotto, ABorgatti, MFinotti, AGambari, RBreveglieri, GChilin, A Psoralen derivatives as inhibitors of NF-¿B/DNA interaction: synthesis, molecular modeling, 3D-QSAR, and biological evaluation. J Med Chem56:1830-42 (2013) 
 
Nuclear factor NF-kappa-B p105 subunit
Name:Nuclear factor NF-kappa-B p105 subunit
Type:Protein
Mol. Mass.:105329.57
Organism:Homo sapiens (Human)
Description:P19838
Residue:968
BDBM50427518
NameBDBM50427518
Synonyms:CHEMBL2322264
TypeSmall organic molecule
Emp. Form.C27H24F3NO4
Mol. Mass.483.479
SMILESCc1c(CCC(=O)Nc2cccc(c2)C(F)(F)F)c(=O)oc2c(C)c3oc4CCCCc4c3cc12