Reaction Details
TargetNuclear factor NF-kappa-B p105 subunit
LigandBDBM50427522
Substrate/Competitorn/a
Meas. Tech.ChEMBL_941587 (CHEMBL2330627)
EC50 700000±n/a nM
Citation Marzaro, GGuiotto, ABorgatti, MFinotti, AGambari, RBreveglieri, GChilin, A Psoralen derivatives as inhibitors of NF-¿B/DNA interaction: synthesis, molecular modeling, 3D-QSAR, and biological evaluation. J Med Chem56:1830-42 (2013) 
 
Nuclear factor NF-kappa-B p105 subunit
Name:Nuclear factor NF-kappa-B p105 subunit
Type:Protein
Mol. Mass.:105329.57
Organism:Homo sapiens (Human)
Description:P19838
Residue:968
BDBM50427522
NameBDBM50427522
Synonyms:CHEMBL2322260
TypeSmall organic molecule
Emp. Form.C26H26N2O6S
Mol. Mass.494.559
SMILESCc1c(CC(=O)Nc2ccc(NS(C)(=O)=O)cc2)c(=O)oc2c(C)c3oc4CCCCc4c3cc12