Reaction Details
TargetNuclear factor NF-kappa-B p105 subunit
LigandBDBM50427523
Substrate/Competitorn/a
Meas. Tech.ChEMBL_941587 (CHEMBL2330627)
EC50 3000000±n/a nM
Citation Marzaro, GGuiotto, ABorgatti, MFinotti, AGambari, RBreveglieri, GChilin, A Psoralen derivatives as inhibitors of NF-¿B/DNA interaction: synthesis, molecular modeling, 3D-QSAR, and biological evaluation. J Med Chem56:1830-42 (2013) 
 
Nuclear factor NF-kappa-B p105 subunit
Name:Nuclear factor NF-kappa-B p105 subunit
Type:Protein
Mol. Mass.:105329.57
Organism:Homo sapiens (Human)
Description:P19838
Residue:968
BDBM50427523
NameBDBM50427523
Synonyms:CHEMBL2322259
TypeSmall organic molecule
Emp. Form.C27H26N2O5
Mol. Mass.458.5057
SMILESCC(=O)Nc1ccc(NC(=O)Cc2c(C)c3cc4c5CCCCc5oc4c(C)c3oc2=O)cc1