Reaction Details
TargetNuclear factor NF-kappa-B p105 subunit
LigandBDBM50427531
Substrate/Competitorn/a
Meas. Tech.ChEMBL_941587 (CHEMBL2330627)
EC50 60000±n/a nM
Citation Marzaro, GGuiotto, ABorgatti, MFinotti, AGambari, RBreveglieri, GChilin, A Psoralen derivatives as inhibitors of NF-¿B/DNA interaction: synthesis, molecular modeling, 3D-QSAR, and biological evaluation. J Med Chem56:1830-42 (2013) 
 
Nuclear factor NF-kappa-B p105 subunit
Name:Nuclear factor NF-kappa-B p105 subunit
Type:Protein
Mol. Mass.:105329.57
Organism:Homo sapiens (Human)
Description:P19838
Residue:968
BDBM50427531
NameBDBM50427531
Synonyms:CHEMBL2322252
TypeSmall organic molecule
Emp. Form.C27H25NO6
Mol. Mass.459.4905
SMILESCc1c(CCC(=O)Nc2ccc(cc2)C(O)=O)c(=O)oc2c(C)c3oc4CCCCc4c3cc12