Reaction Details
TargetMitogen-activated protein kinase 1
LigandBDBM50229978
Substrate/Competitorn/a
Meas. Tech.ChEMBL_941589 (CHEMBL2330629)
Kd 850±n/a nM
Citation Kobe, ACaaveiro, JMTashiro, SKajihara, DKikkawa, MMitani, TTsumoto, K Incorporation of rapid thermodynamic data in fragment-based drug discovery. J Med Chem56:2155-9 (2013) 
 
Mitogen-activated protein kinase 1
Name:Mitogen-activated protein kinase 1
Type:Ser/Thr Protein Kinase
Mol. Mass.:41392.76
Organism:Homo sapiens (Human)
Description:P28482
Residue:360
BDBM50229978
NameBDBM50229978
Synonyms:5-(2-PHENYLPYRAZOLO[1,5-A]PYRIDIN-3-YL)-1H-PYRAZOLO[3,4-C]PYRIDAZIN-3-AMINE 5-(2-phenylH-pyrazolo[1,5-a]pyridin-3-yl)-1H-pyrazolo[3,4-c]pyridazin-3-amine | CHEMBL259551
TypeSmall organic molecule
Emp. Form.C18H13N7
Mol. Mass.327.3427
SMILESNc1n[nH]c2nnc(cc12)-c1c(nn2ccccc12)-c1ccccc1