Reaction Details
TargetSteroid Delta-isomerase
LigandBDBM50375599
Substrate/Competitorn/a
Meas. Tech.ChEMBL_941590 (CHEMBL2330672)
Kd 16000±n/a nM
Citation Kobe, ACaaveiro, JMTashiro, SKajihara, DKikkawa, MMitani, TTsumoto, K Incorporation of rapid thermodynamic data in fragment-based drug discovery. J Med Chem56:2155-9 (2013) 
 
Steroid Delta-isomerase
Name:Steroid Delta-isomerase
Type:PROTEIN
Mol. Mass.:14529.85
Organism:Pseudomonas putida
Description:ChEMBL_941591
Residue:131
BDBM50375599
NameBDBM50375599
Synonyms:DEOXYCHOLATE KYBELLA
TypeSmall organic molecule
Emp. Form.C24H40O4
Mol. Mass.392.572
SMILESC[C@H](CCC(O)=O)[C@H]1CC[C@H]2[C@@H]3CC[C@@H]4C[C@H](O)CC[C@]4(C)[C@H]3C[C@H](O)[C@]12C