Reaction Details
TargetAdenosine receptor A3
LigandBDBM50427591
Substrate/Competitorn/a
Meas. Tech.ChEMBL_941721 (CHEMBL2330944)
Ki 3.2±n/a nM
Citation Squarcialupi, LColotta, VCatarzi, DVarano, FFilacchioni, GVarani, KCorciulo, CVincenzi, FBorea, PAGhelardini, CDi Cesare Mannelli, LCiancetta, AMoro, S 2-Arylpyrazolo[4,3-d]pyrimidin-7-amino derivatives as new potent and selective human A3 adenosine receptor antagonists. Molecular modeling studies and pharmacological evaluation. J Med Chem56:2256-69 (2013) 
 
Adenosine receptor A3
Name:Adenosine receptor A3
Type:G Protein-Coupled Receptor (GPCR)
Mol. Mass.:36197.32
Organism:Homo sapiens (Human)
Description:P0DMS8
Residue:318
BDBM50427591
NameBDBM50427591
Synonyms:CHEMBL2322900
TypeSmall organic molecule
Emp. Form.C23H16N6O
Mol. Mass.392.4127
SMILESO=C(Nc1nc(nc2cn(nc12)-c1ccccc1)-c1ccccc1)c1cccnc1