Reaction Details
TargetAldo-keto reductase family 1 member C1
LigandBDBM50427621
Substrate/Competitorn/a
Meas. Tech.ChEMBL_941821 (CHEMBL2329812)
IC50>100000±n/a nM
Citation Liedtke, AJAdeniji, AOChen, MByrns, MCJin, YChristianson, DWMarnett, LJPenning, TM Development of potent and selective indomethacin analogues for the inhibition of AKR1C3 (Type 5 17ß-hydroxysteroid dehydrogenase/prostaglandin F synthase) in castrate-resistant prostate cancer. J Med Chem56:2429-46 (2013) 
 
Aldo-keto reductase family 1 member C1
Name:Aldo-keto reductase family 1 member C1
Type:Enzyme
Mol. Mass.:36793.97
Organism:Homo sapiens (Human)
Description:Recombinant AKR1C1 enzyme was expressed in E. coli.
Residue:323
BDBM50427621
NameBDBM50427621
Synonyms:CHEMBL2323490 | US9346803, 1
TypeSmall organic molecule
Emp. Form.C19H14ClF3N2O5S
Mol. Mass.474.838
SMILESCOc1ccc2n(cc(CC(=O)NS(=O)(=O)C(F)(F)F)c2c1)C(=O)c1ccc(Cl)cc1