Reaction Details
TargetAldo-keto reductase family 1 member C2
LigandBDBM50427622
Substrate/Competitorn/a
Meas. Tech.ChEMBL_941825 (CHEMBL2329816)
IC50 49570±n/a nM
Citation Liedtke, AJAdeniji, AOChen, MByrns, MCJin, YChristianson, DWMarnett, LJPenning, TM Development of potent and selective indomethacin analogues for the inhibition of AKR1C3 (Type 5 17ß-hydroxysteroid dehydrogenase/prostaglandin F synthase) in castrate-resistant prostate cancer. J Med Chem56:2429-46 (2013) 
 
Aldo-keto reductase family 1 member C2
Name:Aldo-keto reductase family 1 member C2
Type:Enzyme
Mol. Mass.:36739.89
Organism:Homo sapiens (Human)
Description:n/a
Residue:323
BDBM50427622
NameBDBM50427622
Synonyms:CHEMBL2323508 | US9346803, Table 2, Compound 10: 3-[1-(4-chlorobenzoyl)-3-ethyl-5-methoxy-1H-indol-2-yl]propanoic acid
TypeSmall organic molecule
Emp. Form.C21H20ClNO4
Mol. Mass.385.841
SMILESCCc1c(CCC(O)=O)n(C(=O)c2ccc(Cl)cc2)c2ccc(OC)cc12