Reaction Details
TargetAldo-keto reductase family 1 member C2
LigandBDBM50427625
Substrate/Competitorn/a
Meas. Tech.ChEMBL_941825 (CHEMBL2329816)
IC50 56530±n/a nM
Citation Liedtke, AJAdeniji, AOChen, MByrns, MCJin, YChristianson, DWMarnett, LJPenning, TM Development of potent and selective indomethacin analogues for the inhibition of AKR1C3 (Type 5 17ß-hydroxysteroid dehydrogenase/prostaglandin F synthase) in castrate-resistant prostate cancer. J Med Chem56:2429-46 (2013) 
 
Aldo-keto reductase family 1 member C2
Name:Aldo-keto reductase family 1 member C2
Type:Enzyme
Mol. Mass.:36739.89
Organism:Homo sapiens (Human)
Description:n/a
Residue:323
BDBM50427625
NameBDBM50427625
Synonyms:CHEMBL178687 | US9346803, Table 2, Compound 6: 3-[1-(4-chlorobenzoyl)-5-methoxy-2-methyl-1H-indol-3-yl]propanoic acid
TypeSmall organic molecule
Emp. Form.C20H18ClNO4
Mol. Mass.371.814
SMILESCOc1ccc2n(C(=O)c3ccc(Cl)cc3)c(C)c(CCC(O)=O)c2c1