Reaction Details
TargetAldo-keto reductase family 1 member C3
LigandBDBM50427646
Substrate/Competitorn/a
Meas. Tech.ChEMBL_941824 (CHEMBL2329815)
IC50 1190±n/a nM
Citation Liedtke, AJAdeniji, AOChen, MByrns, MCJin, YChristianson, DWMarnett, LJPenning, TM Development of potent and selective indomethacin analogues for the inhibition of AKR1C3 (Type 5 17ß-hydroxysteroid dehydrogenase/prostaglandin F synthase) in castrate-resistant prostate cancer. J Med Chem56:2429-46 (2013) 
 
Aldo-keto reductase family 1 member C3
Name:Aldo-keto reductase family 1 member C3
Type:Enzyme
Mol. Mass.:36859.86
Organism:Homo sapiens (Human)
Description:P42330
Residue:323
BDBM50427646
NameBDBM50427646
Synonyms:CHEMBL2323492
TypeSmall organic molecule
Emp. Form.C28H21ClN2O5S
Mol. Mass.532.995
SMILESCOc1ccc2n(cc(CC(=O)NS(=O)(=O)c3ccc4ccccc4c3)c2c1)C(=O)c1ccc(Cl)cc1