Reaction Details
TargetAldo-keto reductase family 1 member C3
LigandBDBM50427656
Substrate/Competitorn/a
Meas. Tech.ChEMBL_941824 (CHEMBL2329815)
IC50 290±n/a nM
Citation Liedtke, AJAdeniji, AOChen, MByrns, MCJin, YChristianson, DWMarnett, LJPenning, TM Development of potent and selective indomethacin analogues for the inhibition of AKR1C3 (Type 5 17ß-hydroxysteroid dehydrogenase/prostaglandin F synthase) in castrate-resistant prostate cancer. J Med Chem56:2429-46 (2013) 
 
Aldo-keto reductase family 1 member C3
Name:Aldo-keto reductase family 1 member C3
Type:Enzyme
Mol. Mass.:36859.86
Organism:Homo sapiens (Human)
Description:P42330
Residue:323
BDBM50427656
NameBDBM50427656
Synonyms:CHEMBL2323482
TypeSmall organic molecule
Emp. Form.C19H15ClFNO3
Mol. Mass.359.779
SMILESCc1c(CCC(O)=O)c2cc(F)ccc2n1C(=O)c1ccc(Cl)cc1