Reaction Details
TargetAldo-keto reductase family 1 member C3
LigandBDBM50427626
Substrate/Competitorn/a
Meas. Tech.ChEMBL_941824 (CHEMBL2329815)
IC50 740±n/a nM
Citation Liedtke, AJAdeniji, AOChen, MByrns, MCJin, YChristianson, DWMarnett, LJPenning, TM Development of potent and selective indomethacin analogues for the inhibition of AKR1C3 (Type 5 17ß-hydroxysteroid dehydrogenase/prostaglandin F synthase) in castrate-resistant prostate cancer. J Med Chem56:2429-46 (2013) 
 
Aldo-keto reductase family 1 member C3
Name:Aldo-keto reductase family 1 member C3
Type:Enzyme
Mol. Mass.:36859.86
Organism:Homo sapiens (Human)
Description:P42330
Residue:323
BDBM50427626
NameBDBM50427626
Synonyms:CHEMBL2323481 | US9346803, Table 2, Compound 5: 2-[1-(4-chlorobenzoyl)-5-methoxy-2-methyl-1H-indol-3-yl]-N-trifluoromethanesulfonylacetamide
TypeSmall organic molecule
Emp. Form.C20H16ClF3N2O5S
Mol. Mass.488.865
SMILESCOc1ccc2n(C(=O)c3ccc(Cl)cc3)c(C)c(CC(=O)NS(=O)(=O)C(F)(F)F)c2c1