Reaction Details
TargetAldo-keto reductase family 1 member C3
LigandBDBM50427627
Substrate/Competitorn/a
Meas. Tech.ChEMBL_941824 (CHEMBL2329815)
IC50 270±n/a nM
Citation Liedtke, AJAdeniji, AOChen, MByrns, MCJin, YChristianson, DWMarnett, LJPenning, TM Development of potent and selective indomethacin analogues for the inhibition of AKR1C3 (Type 5 17ß-hydroxysteroid dehydrogenase/prostaglandin F synthase) in castrate-resistant prostate cancer. J Med Chem56:2429-46 (2013) 
 
Aldo-keto reductase family 1 member C3
Name:Aldo-keto reductase family 1 member C3
Type:Enzyme
Mol. Mass.:36859.86
Organism:Homo sapiens (Human)
Description:P42330
Residue:323
BDBM50427627
NameBDBM50427627
Synonyms:CHEMBL2323474 | US9346803, Table 2, Compound 9: 2-{5-methoxy-2-methyl-1-[4-(trifluoromethyl)benzoyl]-1H-indol-3-yl}acetic acid
TypeSmall organic molecule
Emp. Form.C20H16F3NO4
Mol. Mass.391.3405
SMILESCOc1ccc2n(C(=O)c3ccc(cc3)C(F)(F)F)c(C)c(CC(O)=O)c2c1