Reaction Details
TargetAldo-keto reductase family 1 member C3
LigandBDBM50427664
Substrate/Competitorn/a
Meas. Tech.ChEMBL_941824 (CHEMBL2329815)
IC50 140±n/a nM
Citation Liedtke, AJAdeniji, AOChen, MByrns, MCJin, YChristianson, DWMarnett, LJPenning, TM Development of potent and selective indomethacin analogues for the inhibition of AKR1C3 (Type 5 17ß-hydroxysteroid dehydrogenase/prostaglandin F synthase) in castrate-resistant prostate cancer. J Med Chem56:2429-46 (2013) 
 
Aldo-keto reductase family 1 member C3
Name:Aldo-keto reductase family 1 member C3
Type:Enzyme
Mol. Mass.:36859.86
Organism:Homo sapiens (Human)
Description:P42330
Residue:323
BDBM50427664
NameBDBM50427664
Synonyms:CHEMBL2323473
TypeSmall organic molecule
Emp. Form.C20H19NO5
Mol. Mass.353.3686
SMILESCOc1ccc(cc1)C(=O)n1c(C)c(CC(O)=O)c2cc(OC)ccc12