Reaction Details
TargetC-C chemokine receptor type 4
LigandBDBM50127138
Substrate/Competitorn/a
Meas. Tech.ChEMBL_941879 (CHEMBL2329945)
IC50 11400±n/a nM
Citation Sassano, MFDoak, AKRoth, BLShoichet, BK Colloidal aggregation causes inhibition of G protein-coupled receptors. J Med Chem56:2406-14 (2013) 
 
C-C chemokine receptor type 4
Name:C-C chemokine receptor type 4
Type:Enzyme
Mol. Mass.:41406.41
Organism:Homo sapiens (Human)
Description:P51679
Residue:360
BDBM50127138
NameBDBM50127138
Synonyms:2-(butan-2-yl)-4-{4-[4-(4-{[(2R,4S)-2-(2,4-dichlorophenyl)-2-(1H-1,2,4-triazol-1-ylmethyl)-1,3-dioxolan-4-yl]methoxy}phenyl)piperazin-1-yl]phenyl}-2,4-dihydro-3H-1,2,4-triazol-3-one ITRACONAZOLE Oriconazole | Sporanox (TN)
TypeSmall organic molecule
Emp. Form.C35H38Cl2N8O4
Mol. Mass.705.633
SMILESCCC(C)n1ncn(-c2ccc(cc2)N2CCN(CC2)c2ccc(OC[C@H]3CO[C@@](Cn4cncn4)(O3)c3ccc(Cl)cc3Cl)cc2)c1=O