Reaction Details
TargetC-C chemokine receptor type 4
LigandBDBM7460
Substrate/Competitorn/a
Meas. Tech.ChEMBL_941880 (CHEMBL2329946)
IC50 100000±n/a nM
Citation Sassano, MFDoak, AKRoth, BLShoichet, BK Colloidal aggregation causes inhibition of G protein-coupled receptors. J Med Chem56:2406-14 (2013) 
 
C-C chemokine receptor type 4
Name:C-C chemokine receptor type 4
Type:Enzyme
Mol. Mass.:41406.41
Organism:Homo sapiens (Human)
Description:P51679
Residue:360
BDBM7460
NameBDBM7460
Synonyms:2-(3,4-dihydroxyphenyl)-3,5,7-trihydroxy-4H-chromen-4-one 2-(3,4-dihydroxyphenyl)-3,5,7-trihydroxy-chromone;hydrate Quercetin Quercetin (21) US11021454, Compound Quercetin med.21724, Compound 4
TypeSmall organic molecule
Emp. Form.C15H10O7
Mol. Mass.302.2357
SMILESOc1cc(O)c2c(c1)oc(-c1ccc(O)c(O)c1)c(O)c2=O