Reaction Details
TargetPhospholipase D1
LigandBDBM50427800
Substrate/Competitorn/a
Meas. Tech.ChEMBL_942032 (CHEMBL2330326)
IC50 48±n/a nM
Citation O'Reilly, MCScott, SABrown, KAOguin, THThomas, PGDaniels, JSMorrison, RBrown, HALindsley, CW Development of dual PLD1/2 and PLD2 selective inhibitors from a common 1,3,8-Triazaspiro[4.5]decane Core: discovery of Ml298 and Ml299 that decrease invasive migration in U87-MG glioblastoma cells. J Med Chem56:2695-9 (2013) 
 
Phospholipase D1
Name:Phospholipase D1
Type:Protein
Mol. Mass.:124219.92
Organism:Homo sapiens (Human)
Description:Q13393
Residue:1074
BDBM50427800
NameBDBM50427800
Synonyms:CHEMBL2325485
TypeSmall organic molecule
Emp. Form.C24H29BrN4O2
Mol. Mass.485.417
SMILESC[C@@H](CN1CCC2(CC1)N(CNC2=O)c1cccc(C)c1)NC(=O)c1ccc(Br)cc1