Reaction Details
TargetPhospholipase D2
LigandBDBM50427806
Substrate/Competitorn/a
Meas. Tech.ChEMBL_942033 (CHEMBL2330327)
IC50 200±n/a nM
Citation O'Reilly, MCScott, SABrown, KAOguin, THThomas, PGDaniels, JSMorrison, RBrown, HALindsley, CW Development of dual PLD1/2 and PLD2 selective inhibitors from a common 1,3,8-Triazaspiro[4.5]decane Core: discovery of Ml298 and Ml299 that decrease invasive migration in U87-MG glioblastoma cells. J Med Chem56:2695-9 (2013) 
 
Phospholipase D2
Name:Phospholipase D2
Type:Protein
Mol. Mass.:106002.47
Organism:Homo sapiens (Human)
Description:n/a
Residue:933
BDBM50427806
NameBDBM50427806
Synonyms:CHEMBL2325484
TypeSmall organic molecule
Emp. Form.C22H24BrFN4O2
Mol. Mass.475.354
SMILESFc1cccc(c1)N1CNC(=O)C11CCN(CCNC(=O)c2ccc(Br)cc2)CC1